Agenda 2000
type: Concept
broader: agreements
in scheme: conceptscheme
scope note: Agenda 2000 är en handlingsplan och ett åtgärdsprogram som Europeiska kommissionen antog 1997 för att stabilisera unionen inför utvidgningen @sv
scope note: Asiakirja, joka sisältää EU-komission linjaukset lähestyttäessä vuotta 2000, erityisesti näkemyksiä maatalous-, alue- ja rakennepolitiikan kehittämisestä

agreements
type: Concept
narrower: Agenda 2000
preferred label: sopimukset @fi
preferred label: avtal @sv