laminat
type: Concept
source: SFS 2457 Puukalusteet. Laatuvaatimukset Kitchen furniture. Quality requirements
comment: pinnoite, joka on valmistettu erillisessä prosessissa liittämällä yhteen vähintään kaksi erillistä kalvoa Kalvoihin on imeytetty lämpökovetteista hartsia tai hartsiseosta.Laminaatin pintakerroksena on yleensä mekaanista kulutusta ja kemiallista rasitusta kestävä kerros.
broader: ytbeläggningar
in scheme: conceptscheme
preferred label: laminate @en
preferred label: laminaatti @fi

ytbeläggningar
type: Concept
narrower: laminat
preferred label: pinnoitteet @fi
preferred label: coatings @en