groups
type: Concept
narrower: Forest Brothers
preferred label: grupper @sv
preferred label: ryhmät @fi

Forest Brothers
type: Concept
alternative label: Forest Brotherhood
broader: groups
in scheme: conceptscheme
preferred label: skogsbröder @sv
preferred label: metsäveljet @fi
related: resistance movements
scope note: Skogsbröderna kallades de motståndsrörelser som kämpade mot den sovjetiska ockupationen av de baltiska staterna @sv

resistance movements
type: Concept
preferred label: vastarintaliikkeet @fi
preferred label: motståndsrörelser @sv
related: Forest Brothers