geokätköily
type: Concept
alternative label: geokätkentä
broader: liikkuminen
in scheme: conceptscheme
preferred label: geocaching @en
scope note: Modern och världsomspännande variant av skattjakt utomhus, där man dock inte har någon karta. Utövaren söker med hjälp av en GPS-mottagare. @sv

liikkuminen
type: Concept
narrower: geokätköily
preferred label: motionering @sv
preferred label: bodily exercise @en