lineaari B
type: Concept
alternative label: lineaari-B-kirjoitusjärjestelmä
alternative label: lineaari-B
broader: lineaarikirjoitus
in scheme: conceptscheme
preferred label: linear B @en
scope note: Skriftspråk som användes av den Mykenska kulturen på Kreta och i det egeiska området 1400 f.Kr.-1200 f.Kr. @sv

lineaarikirjoitus
type: Concept
narrower: lineaari B
preferred label: linear script @en
preferred label: linearskrift @sv