Ungernrevolten
type: Concept
broader: uppror
in scheme: conceptscheme
preferred label: Hungarian Revolution of 1956 @en
preferred label: Unkarin kansannousu @fi
scope note: Ungernrevolten var ett folkuppror i Ungern 1956 som ägde rum mellan 23 oktober och 4 november.

uppror
type: Concept
narrower: Ungernrevolten
preferred label: rebellion @en
preferred label: kapinat @fi