working machines
type: Concept
narrower: engine-driven machines
preferred label: arbetsmaskiner @sv
preferred label: työkoneet @fi

engine-driven machines
type: Concept
source: AKE
comment: työkoneeksi rakennettu ajoneuvo. Moottorityökoneita ovat esimerkiksi kauhakuormaimet, puominosturit ja lakaisukoneet.
broader: working machines
broader: motor vehicles
in scheme: conceptscheme
preferred label: motorredskap @sv
preferred label: moottorityökoneet @fi

motor vehicles
type: Concept
narrower: engine-driven machines
preferred label: motorfordon @sv
preferred label: moottoriajoneuvot @fi