experimentella romaner
type: Concept
preferred label: experimental novels @en
preferred label: kokeelliset romaanit @fi
related: nya romanen

nya romanen
type: Concept
broader: litterära stilar
in scheme: conceptscheme
preferred label: uusi romaani @fi
preferred label: nouveau roman @en
related: experimentella romaner
scope note: En riktning inom litteraturen som uppkom i Frankrike i medlet av 1950-talet Typiskt för den nya romanens berättande är en splittrad tidskonstruktion, en pedantisk skildring av den materiella världen samt alternativa lösningar för slutet.

litterära stilar
type: Concept
narrower: nya romanen
preferred label: literary styles @en
preferred label: kirjallisuuden tyylit @fi