biologiska fenomen
type: Concept
narrower: gallbildning
preferred label: biological phenomena @en
preferred label: biologiset ilmiöt @fi

gallbildning
type: Concept
source: Kielitoimiston sanakirja
comment: vars. loiseliöiden aiheuttamia kasvien pieniä kasvannaisia
broader: biologiska fenomen
in scheme: conceptscheme
preferred label: galls @en
preferred label: äkämät @fi