hacking
type: Concept
preferred label: dataintrång @sv
preferred label: hakkerointi @fi
related: hackers

hackers
type: Concept
source: Tietotekniikan termitalkoot
comment: henkilö, joka tunkeutuu luvatta tietoverkkoon tai tietojärjestelmään tai käyttää luvatta tietoa, ohjelmaa tai palvelua Hakkeri saattaa esimerkiksi tuhota tietojärjestelmästä tietoja tai käyttää järjestelmää omiin tarkoituksiinsa. (Hakkeri-sanalla voidaan viitata myös innokkaaseen tietokoneharrastajaan.)
broader: role related to action
in scheme: conceptscheme
preferred label: hakkerit @fi
preferred label: hackare @sv
related: hacking

role related to action
type: Concept
narrower: hackers
preferred label: sysselsättningsrelaterad roll @sv
preferred label: toimintaan liittyvä rooli @fi