Web 2.0
type: Concept
related: RSS-flöden

RSS-flöden
type: Concept
alternative label: RSS-flöde
broader: webbflöde
in scheme: conceptscheme
preferred label: RSS feeds @en
preferred label: RSS-syötteet @fi
related: Web 2.0
scope note: Rich Site Summary och för Really Simple Syndication, standardformat (baserat på XML) för överföring av prenumererad information på Internet, t.ex. nya program i poddradio och podd-TV eller nya inlägg i bloggar. Källa: NE

webbflöde
type: Concept
narrower: RSS-flöden
preferred label: web feeds @en
preferred label: verkkosyötteet @fi