kulning
type: Concept
broader: kulturella alster
in scheme: conceptscheme
preferred label: cattle calls @en
preferred label: karjankutsut @fi
scope note: Kulning är en inhemsk skandinavisk sångform som användes i vallmusiken.

kulturella alster
type: Concept
narrower: kulning
preferred label: cultural accomplishments @en
preferred label: kulttuuriset tuotokset @fi