substraatti (kielelliset ilmiöt)
type: Concept
source: YSA
comment: sana tai kieliopillinen muoto, joka on säilynyt valloittajan, siirtolaisten tai uudisasukkaiden maahan tuomassa valtakielessä jäänteenä siellä aiemmin puhutusta
alternative label: substraatti
broader: kielihistorialliset ilmiöt
in scheme: conceptscheme
preferred label: substrat (språkliga fenomen) @sv

kielihistorialliset ilmiöt
type: Concept
narrower: substraatti (kielelliset ilmiöt)