hasardgeografi
type: Concept
broader: geografi (vetenskap)
in scheme: conceptscheme
preferred label: hazard geography @en
preferred label: hasardimaantiede @fi
scope note: Hasardgeografi innefattar olika typer av risker som värden utsätts för. Riskerna kan vara naturgeografiska eller anknutna till mänsklig verksamhet.

geografi (vetenskap)
type: Concept
narrower: hasardgeografi
preferred label: geography @en
preferred label: maantiede @fi