samtycke
type: Concept
narrower: informerat samtycke
preferred label: consent @en
preferred label: suostumus @fi

informerat samtycke
type: Concept
alternative label: tietoinen suostumus @fi
broader: samtycke
in scheme: conceptscheme
preferred label: tietoon perustuva suostumus @fi
preferred label: informed consent @en
scope note: När forskning involverar människor skall de, med få undantag, informeras om forskningen och sin medverkan och fritt kunna välja om de vill medverka eller inte.