yhteiskunnalliset ilmiöt
type: Concept
narrower: diffuusio (yhteiskunnalliset ilmiöt)
preferred label: samhälleliga fenomen @sv
preferred label: societal phenomena @en

diffuusio (yhteiskunnalliset ilmiöt)
type: Concept
comment: kulttuuripiirteiden siirtyminen ryhmältä toiselle
broader: yhteiskunnalliset ilmiöt
in scheme: conceptscheme