hallitukset (hallintoelimet)
type: Concept
comment: muut kuin viranomaistahoihin liittyvät hallitukset (esim. yritysten ja yhdistysten hallitukset)
alternative label: hallitukset
broader: hallintoelimet
in scheme: conceptscheme
preferred label: cabinets @en
preferred label: regeringar (förvaltningsorgan) @sv

hallintoelimet
type: Concept
narrower: hallitukset (hallintoelimet)
preferred label: administrativa organ @sv
preferred label: administrative bodies @en