abhaasit
type: Concept
source: Wikipedia
alternative label: abhasit
broader: kansat (väestöryhmät)
in scheme: conceptscheme
scope note: Georgiaan kuuluvassa, mutta de facto itsenäisessä Abhasian tasavallassa, Turkissa ja Lähi-idässä asuva luoteiskaukasialaista abhaasin kieltä puhuva kansa

kansat (väestöryhmät)
type: Concept
narrower: abhaasit
preferred label: folk (befolkningsgrupper) @sv
preferred label: peoples @en