arbetsinnehåll
type: Concept
broader: innehåll
preferred label: work content @en
preferred label: työn sisältö @fi

innehåll
type: Concept
source: Suomen kielen perussanakirja
comment: 1) se mikä on jonkin sisällä (erillisenä, esiin otettavana), sisällys; 2) jonkin ilmaisun, toiminnan tms. merkitys, mieli, olemus, vars. ulkonaisen muodon vastakohtana; sisällysluettelon otsikkona tavallisemmin: sisällys
broader: annan roll
in scheme: conceptscheme
narrower: arbetsinnehåll
preferred label: sisältö @fi
preferred label: content @en

annan roll
type: Concept
narrower: innehåll
preferred label: muu rooli @fi
preferred label: other role @en