dekabristit
type: Concept
source: Web-Facta
broader: aatteelliseen ryhmään liittyvä rooli
in scheme: conceptscheme
preferred label: dekabristerna @sv
related: kapinaliikkeet
scope note: Pietarissa joulukuussa v. 1825 puhjenneen kapinan osanottajat. Dekabristit olivat pääasiallisesti upseereita ja virkamiehiä, jotka yrittivät hallitsijan vaihdoksen yhteydessä toteuttaa länsimaisen, perustuslaillisen hallitusmuodon myös Venäjällä, lakkauttaa maaorjuuden ja toteuttaa kansalaisten yhdenvertaisuuden

aatteelliseen ryhmään liittyvä rooli
type: Concept
narrower: dekabristit
preferred label: role related to ideological group @en
preferred label: roll i anslutning till ideologisk grupp @sv

kapinaliikkeet
type: Concept
preferred label: rebellious movements @en
preferred label: upprorsrörelser @sv
related: dekabristit