peripateettinen koulukunta
type: Concept
broader: koulukunnat
in scheme: conceptscheme
scope note: Aristoteleen Ateenassa perustama filosofinen koulukunta

koulukunnat
type: Concept
narrower: peripateettinen koulukunta
preferred label: skolor (läroriktningar) @sv
preferred label: schools of thought @en