avovesiuinti
type: Concept
source: Wikipedia
broader: uinti
in scheme: conceptscheme
preferred label: öppet vatten-simning @sv
scope note: Uintilaji, joka tapahtuu avovedessä, kuten meressä, järvessä tai joessa

uinti
type: Concept
narrower: avovesiuinti
preferred label: swim @en
preferred label: simning @sv