voimalat
type: Concept
narrower: pienvoimalat
preferred label: kraftverk @sv
preferred label: power stations @en

pienvoimalat
type: Concept
broader: voimalat
in scheme: conceptscheme
preferred label: småkraftverk @sv
scope note: Tuotantolaitos, joka on liitetty paikallisen verkonhaltijan pien- tai keskijänniteverkkoon tai siihen liitetyn asiakkaan verkkoon. Pienjänniteverkko on 0,4 kV:n ja keskijänniteverkko on 6-70 kV:n jännitteinen sähköverkko