energia
type: Concept
narrower: fuusioenergia
preferred label: energi @sv
preferred label: energy @en

fuusioenergia
type: Concept
source: http://www.energia.fi/energia-ja-ymparisto/energialahteet/fuusioenergia
alternative label: fuusiovoima
broader: energia
in scheme: conceptscheme
preferred label: fusionsenergi @sv
scope note: Fuusiossa energian tuotanto perustuu kahden kevyen atomiytimen yhdistymisreaktioon, jossa samanaikaisesti vapautuu runsaasti energiaa