tuomarit
type: Concept
narrower: kihlakunnantuomarit
preferred label: judges @en
preferred label: domare @sv

kihlakunnantuomarit
type: Concept
source: Kielitieteen sanakirja
broader: tuomarit
in scheme: conceptscheme
scope note: Tarkoittaa tuomaria, joka toimi kihlakunnanoikeuden puheenjohtajana (ja hallinnollisena päällikkönä)