sodat (tapahtumat)
type: Concept
narrower: Kosovon sota
preferred label: wars @en
preferred label: krig @sv

Kosovon sota
type: Concept
source: Wikipedia
broader: Jugoslavian hajoamissodat
broader: sodat (tapahtumat)
in scheme: conceptscheme
scope note: Kosovon sota tarkoittaa kahta aseellista selkkausta (sisällissotaa ja kansainvälistä sotaa) entisen Jugoslavian alueella. 1) Sisällissota 1996-1999. 2) NATOn hyökkäys Jugoslaviaan vuonna 1999

Jugoslavian hajoamissodat
type: Concept
narrower: Kosovon sota
preferred label: jugoslaviska krigen @sv