jalokivet
type: Concept
preferred label: jewels @en
preferred label: ädelstenar @sv
related: opaali

mineraalit
type: Concept
narrower: opaali
preferred label: mineral @sv
preferred label: minerals @en

opaali
type: Concept
source: Kielitoimiston sanakirja
broader: mineraalit
in scheme: conceptscheme
related: jalokivet
scope note: Piioksidia ja vettä sisältävä mineraali, jonka eräitä muunnoksia käytetään jalokivinä