petopunkit
type: Concept
narrower: nenäpunkki
preferred label: mesostigmata @en
preferred label: rovkvalster @sv

nenäpunkki
type: Concept
source: Wikipedia
broader: petopunkit
in scheme: conceptscheme
scope note: Koiran nenä- ja poskionteloiden sekä nenäkuorikoiden limakalvoilla elävä loinen, jota ei ole tavattu muilla eläinlajeilla