biologiset ilmiöt
type: Concept
narrower: plasmasytoosi
preferred label: biologiska fenomen @sv
preferred label: biological phenomena @en

plasmasytoosi
type: Concept
broader: biologiset ilmiöt
in scheme: conceptscheme
scope note: Plasmasolujen runsaus veressä tai muissa kudoksissa