Occupy-liike
type: Concept
source: Wikipedia
alternative label: Vallatkaa Wall Street
alternative label: Occupy Wall Street -liike
broader: protestiliikkeet
in scheme: conceptscheme
scope note: Protestiliike ja mielensoitus talouden valtaa vastaan Wall Streetillä New Yorkissa Yhdysvalloissa. Mielenosoitukset alkoivat 17. syyskuuta 2011. Occupy-liikkeen mielestä maan talousvaikeudet johtuvat epäonnistuneesta talouspolitiikasta sekä hallinnon ja talouden läheisistä kytköksistä

protestiliikkeet
type: Concept
narrower: Occupy-liike
preferred label: protest movements @en
preferred label: proteströrelser @sv