haamilaiset kielet
type: Concept
narrower: hausan kieli
preferred label: hamitiska språk @sv
preferred label: hamitic languages @en

hausan kieli
type: Concept
source: Wikipedia
alternative label: haussan kieli
broader: haamilaiset kielet
in scheme: conceptscheme
scope note: Afrikan toiseksi puhutuin kieli, jolla on yli 46 miljoonaa äidinkielistä puhujaa. Lisäksi sitä puhuu toisena kielenään noin 15 miljoonaa ihmistä. Suurin osa äidinkielisistä puhujista asuu Nigeriassa sekä Nigerissä. Lisäksi hausaa käytetään lingua francana useissa Länsi-Afrikan maissa erityisesti muslimien keskuudessa