4G-tekniikka
type: Concept
source: Laajakaistasanasto
broader: tietoliikennetekniikka
in scheme: conceptscheme
preferred label: 4G-teknik @sv
scope note: Tarkoittaa neljännen sukupolven matkaviestintekniikkaa, jonka avulla voidaan siirtää erittäin nopeasti suuria määriä puhetta ja tietoa

tietoliikennetekniikka
type: Concept
narrower: 4G-tekniikka
preferred label: telekommunikationsteknik @sv
preferred label: communications technology @en