urheilukilpailut
type: Concept
narrower: Vaasahiihto
preferred label: athletic contests @en
preferred label: idrottstävlingar @sv

Vaasahiihto
type: Concept
source: Wikipedia
alternative label: Vaasa-hiihto
alternative label: Vasaloppet
broader: urheilukilpailut
in scheme: conceptscheme
scope note: Ruotsissa vuosittain maaliskuun ensimmäisenä sunnuntaina järjestettävä maailman suurin yksittäinen maastohiihtokilpailu. Vaasahiihdossa hiihdettävä matka Sälenistä Moraan on noin 90 kilometriä. Ensimmäisen kerran hiihto järjestettiin vuonna 1922