etätyö
type: Concept
preferred label: distance work @en
preferred label: distansarbete @sv
related: hajautettu työ

työ
type: Concept
narrower: hajautettu työ
preferred label: work @en
preferred label: arbete @sv

hajautettu työ
type: Concept
source: Wikipedia
alternative label: läsnätyö
broader: työ
in scheme: conceptscheme
preferred label: distribuerat arbete @sv
related: etätyö
scope note: Hajautettu työ on perinteistä kotona tehtävää etätyötä laajempi käsite. Hajautetulla työllä viitataan joko osittain tai kokonaan tieto- ja viestintätekniikan välityksellä tapahtuvaan työn organisointiin tietyn yhteisen tavoitteen saavuttamiseksi

työ työn luonteen mukaan
type: Collection
member: hajautettu työ