syyrian kieli
type: Concept
source: Wikipedia
broader: aramean kieli
in scheme: conceptscheme
scope note: Itäaramealainen kieli, jota aikoinaan puhuttiin laajalti hedelmällisen puolikuun alueella. Laajimmassa määritelmässään syyriaa käytetään usein viittaamaan kaikkiin itäaramealaisiin kieliin, joita puhutaan alueen erilaisten kristinuskoa tunnustavien ryhmien kuten assyrialaiskristittyjen parissa; erityisimmässä merkityksessään sillä viitataan Edessan klassiseen kieleen, josta muotoutui syyrialaisen kristillisyyden kieli

aramean kieli
type: Concept
narrower: syyrian kieli
preferred label: arameiska @sv
preferred label: aramaic @en