ruteenit
type: Concept
source: Wikipedia
alternative label: rusynit
broader: slaavit
in scheme: conceptscheme
scope note: Itäisen Keski-Euroopan eri alueilla hajallaan elävä slaavilainen kansa, joka puhuu omaa, itäslaavilaisiin kieliin kuuluvaa ruteenin kieltään. Ruteenien perinteisenä kotiseutuna pidetään Ruteniaa. Suurimmat nykyiset ruteenien keskittymät ovat Slovakiassa, Ukrainassa (karpatoruteenit), Puolassa ja Serbian Vojvodinassa

slaavit
type: Concept
narrower: ruteenit
preferred label: Slavic peoples @en
preferred label: slaver @sv