kuvernementit
type: Concept
source: Kielitoimiston sanakirja
broader: hallintoalueet
in scheme: conceptscheme
scope note: Lääniä vastaava hallintoalue eräissä maissa

hallintoalueet
type: Concept
narrower: kuvernementit
preferred label: administrative areas @en
preferred label: förvaltningsområden @sv