selluloosa
type: Concept
narrower: nanoselluloosa
preferred label: cellulosa @sv
preferred label: cellulose @en

nanoselluloosa
type: Concept
broader: selluloosa
in scheme: conceptscheme
preferred label: nanocellulosa @sv
scope note: Nanoselluoosa on hyvin pieniksi säikeiksi kuorittua ja pilkottua perinteistä selluloosakuitua, jolloin siitä tulee geelimäistä hyytelöä. Nanoselluloosaa on mahdollista hyödyntää laajasti eri teollisuuden aloilla ja tuotteissa. Sen sovelluskohteita ovat esimerkiksi erikoispaperit, paperipinnoitteet, pakkaukset ja rakennusmateriaalit