mangrovet
type: Concept
source: Kielitoimiston sanakirja
alternative label: mangrovemetsiköt
alternative label: mangrovemetsät
broader: metsät
in scheme: conceptscheme
preferred label: mangrove @sv
scope note: Trooppisten merenrannikoiden (lietepohjainen) tiheä pensas- tai metsävyöhyke

metsät
type: Concept
narrower: mangrovet
preferred label: forests @en
preferred label: skogar @sv