orgaaninen elektroniikka
type: Concept
broader: elektroniikka
in scheme: conceptscheme
scope note: Elektroniikka, joka pohjautuu hiilipohjaisten materiaalien käyttöön piipohjaisten sijaan

elektroniikka
type: Concept
narrower: orgaaninen elektroniikka
preferred label: elektronik @sv
preferred label: electronics @en