ruokakasvatus
type: Concept
broader: kasvatus (ihmisen)
in scheme: conceptscheme
preferred label: matpedagogik @sv
scope note: Ruokakasvatusta annetaan mm. päiväkodeissa ja kouluissa. Koulussa ruokakasvatus nivoutuu useaan oppiaineeseen ja siihen kuuluu myös kouluruokailu ja muu kouluaikaiseen ruokailemiseen liittyvä toiminta (mm. välipalat). Ruokakasvatus on osa koulujen kestävyyskasvatusta

kasvatus (ihmisen)
type: Concept
narrower: ruokakasvatus
preferred label: upbringing @en
preferred label: fostran @sv