sosiogrammit
type: Concept
source: Wikipedia
broader: graafinen esitys
in scheme: conceptscheme
preferred label: sociogram @sv
related: ihmissuhteet
scope note: Graafinen esitys jonkun henkilön sosiaalisista siteistä eli eräänlainen ihmissuhdekaavio. Sosiogrammi perustuu ryhmän jäsenille tehdystä kyselystä saatuihin vastauksiin

graafinen esitys
type: Concept
narrower: sosiogrammit
preferred label: graphical presentation @en
preferred label: grafisk framställning @sv

ihmissuhteet
type: Concept
preferred label: human relations @en
preferred label: mänskliga relationer @sv
related: sosiogrammit