festivaalit
type: Concept
narrower: Helsingin nuorisofestivaali
preferred label: festivals @en
preferred label: festivaler @sv

Helsingin nuorisofestivaali
type: Concept
source: Wikipedia
alternative label: Helsingin nuorisofestivaali 1962
broader: festivaalit
in scheme: conceptscheme
scope note: Helsingin vuoden 1962 nuorisofestivaalit eli Maailman nuorison ja ylioppilaiden VIII maailmankonferenssi järjestettiin Helsingissä 28. heinäkuuta - 6. elokuuta 1962. Kymmenpäiväisen festivaalin järjestäjänä toimi Demokraattisen Nuorison Maailmanliitto (DNML) sekä Prahassa päämajaansa pitänyt International Union of Students (IUS) ja niiden taustalla Neuvostoliitto ja sen liittolaiset