kolorismi
type: Concept
broader: tyylit (ilmiöt)
in scheme: conceptscheme
scope note: Tarkoittaa maalaustaiteessa värin käyttöä hallitsevana ilmaisukeinona

tyylit (ilmiöt)
type: Concept
narrower: kolorismi
preferred label: stilar (fenomen) @sv
preferred label: styles @en