lastenpelit
type: Concept
broader: pelit
in scheme: conceptscheme
preferred label: barnspel @sv
scope note: Selvästi lapsille suunnatut pelit, jotka ovat yleensä aikuisille liian helppoja. Digitaalisissa peleissä lastenpelit sisältävät usein lapsille suunnattuja söpöjä pelihahmoja

pelit
type: Concept
narrower: lastenpelit
preferred label: games @en
preferred label: spel @sv