mittarit (mittauslaitteet)
type: Concept
narrower: spektrometrit
preferred label: mätare @sv
preferred label: meters @en

spektrometrit
type: Concept
source: Lähde: Turtia, K. Sivistyssanat
broader: mittarit (mittauslaitteet)
in scheme: conceptscheme
preferred label: spektrometrar @sv
scope note: Laite, jonka avulla mitataan tutkittavan säteilyn, varsinaisesti valon, aallonpituudet