Federal Theatre-projektet
type: Concept
source: Lähde: Ojanen, R., Amerikkalaisen liittovaltioteatterin nousu ja tuho
broader: projekt
in scheme: conceptscheme
preferred label: Federal Theatre Project @en
preferred label: Federal Theatre -projekti @fi
scope note: The Federal Theatre -projekti oli 30-luvun talouslaman aikainen ja jälkeinen, Rooseveltin hallituksen sosiaalipoliittisen ohjelman, New Dealin, henkeen toteutettu, julkisin varoin rahoitettu teatteriorganisaatio. Projekti sisälsi myös leimallisesti kokeilullisena foorumina The Living Newspaperin, joka tuotti uusia, Yhdysvaltain ajankohtaisiin, sosiaalisiin ilmiöihin liittyneitä tekstejä ja niiden pohjalta tehtyjä esityksiä

projekt
type: Concept
narrower: Federal Theatre-projektet
preferred label: projects @en
preferred label: projektit @fi