skogsnämnder
type: Concept
preferred label: forest boards @en
preferred label: metsälautakunnat @fi
related: skogscentraler

skogscentraler
type: Concept
broader: centrer (organisationer)
in scheme: conceptscheme
preferred label: metsäkeskukset @fi
preferred label: forest centres @en
related: skogsnämnder
scope note: Benämningen skogscentral används sedan år 1994, tidigare skogsnämnder
scope note: Nimitys käytössä vuodesta 1994 lähtien, aiemmat katso metsälautakunnat

centrer (organisationer)
type: Concept
narrower: skogscentraler
preferred label: keskukset @fi
preferred label: centres @en