byggnader
type: Concept
narrower: Myllykolu
preferred label: buildings @en
preferred label: rakennukset @fi

Myllykolu
type: Concept
comment: F. E. Sillanpään syntymä- ja lapsuudenkoti Hämeenkyrössä
broader: byggnader
in scheme: conceptscheme