naturskyddsområden
type: Concept
narrower: Vänskapens park
preferred label: nature reserves @en
preferred label: luonnonsuojelualueet @fi

Vänskapens park
type: Concept
source: Lähde: Nykysuomen tietosanakirja. 2, Maat ja paikat
broader: naturskyddsområden
in scheme: conceptscheme
preferred label: Ystävyyden puisto @fi
scope note: Koostuu viidestä erillisestä luonnonsuojelualueesta: Ulvinsalon luonnonpuisto, Juortanansalon-Lapinsuon soidensuojelualue, Elimyssalon, Lentuan, Ison-Palosen ja Maariansärkkien luononsuojelualueet. Ystävyyden puisto ja Venäjän puolella sijaitseva Kostamuksen luonnonsuojelualue muodostavat yhdessä Ystävyyden luonnonsuojelualueen